Reaction Details
TargetPeptidyl-prolyl cis-trans isomerase NIMA-interacting 1
LigandBDBM50329870
Substrate/Competitorn/a
Meas. Tech.ChEMBL_675735 (CHEMBL1272369)
IC50 4000±n/a nM
Citation Potter, AOldfield, VNunns, CFromont, CRay, SNorthfield, CJBryant, CJScrace, SFRobinson, DMatossova, NBaker, LDokurno, PSurgenor, AEDavis, BRichardson, CMMurray, JBMoore, JD Discovery of cell-active phenyl-imidazole Pin1 inhibitors by structure-guided fragment evolution. Bioorg Med Chem Lett20:6483-8 (2010) 
 
Peptidyl-prolyl cis-trans isomerase NIMA-interacting 1
Name:Peptidyl-prolyl cis-trans isomerase NIMA-interacting 1
Type:PROTEIN
Mol. Mass.:18248.11
Organism:Homo sapiens (Human)
Description:ChEMBL_1502595
Residue:163
BDBM50329870
NameBDBM50329870
Synonyms:4-(dibenzylcarbamoyl)-2-phenyl-1H-imidazole-5-carboxylic acid | CHEMBL1272034
TypeSmall organic molecule
Emp. Form.C25H21N3O3
Mol. Mass.411.4525
SMILESOC(=O)c1nc([nH]c1C(=O)N(Cc1ccccc1)Cc1ccccc1)-c1ccccc1