Reaction Details
TargetPeptidyl-prolyl cis-trans isomerase NIMA-interacting 1
LigandBDBM50329873
Substrate/Competitorn/a
Meas. Tech.ChEMBL_675735 (CHEMBL1272369)
IC50 520±n/a nM
Citation Potter, AOldfield, VNunns, CFromont, CRay, SNorthfield, CJBryant, CJScrace, SFRobinson, DMatossova, NBaker, LDokurno, PSurgenor, AEDavis, BRichardson, CMMurray, JBMoore, JD Discovery of cell-active phenyl-imidazole Pin1 inhibitors by structure-guided fragment evolution. Bioorg Med Chem Lett20:6483-8 (2010) 
 
Peptidyl-prolyl cis-trans isomerase NIMA-interacting 1
Name:Peptidyl-prolyl cis-trans isomerase NIMA-interacting 1
Type:PROTEIN
Mol. Mass.:18248.11
Organism:Homo sapiens (Human)
Description:ChEMBL_1502595
Residue:163
BDBM50329873
NameBDBM50329873
Synonyms:4-((2-amino-2-oxoethyl)(benzo[d]thiazol-2-ylmethyl)carbamoyl)-2-phenyl-1H-imidazole-5-carboxylic acid | CHEMBL1272138
TypeSmall organic molecule
Emp. Form.C21H17N5O4S
Mol. Mass.435.456
SMILESNC(=O)CN(Cc1nc2ccccc2s1)C(=O)c1[nH]c(nc1C(O)=O)-c1ccccc1