Reaction Details
TargetBifunctional epoxide hydrolase 2
LigandBDBM50330101
Substrate/Competitorn/a
Meas. Tech.ChEMBL_676148 (CHEMBL1273199)
IC50 450±n/a nM
Citation Lo, HYMan, CCFleck, RWFarrow, NAIngraham, RHKukulka, AProudfoot, JRBetageri, RKirrane, TPatel, USharma, RHoermann, MAKabcenell, ALombaert, SD Substituted pyrazoles as novel sEH antagonist: investigation of key binding interactions within the catalytic domain. Bioorg Med Chem Lett20:6379-83 (2010) 
 
Bifunctional epoxide hydrolase 2
Name:Bifunctional epoxide hydrolase 2
Type:Enzyme
Mol. Mass.:62613.07
Organism:Homo sapiens (Human)
Description:P34913
Residue:555
BDBM50330101
NameBDBM50330101
Synonyms:4-(3-(pyridin-3-yl)-5-(trifluoromethyl)-1H-pyrazol-1-yl)-N-(pyridin-4-yl)benzamide | CHEMBL1271551
TypeSmall organic molecule
Emp. Form.C21H14F3N5O
Mol. Mass.409.364
SMILESFC(F)(F)c1cc(nn1-c1ccc(cc1)C(=O)Nc1ccncc1)-c1cccnc1