Reaction Details
TargetBifunctional epoxide hydrolase 2
LigandBDBM50330102
Substrate/Competitorn/a
Meas. Tech.ChEMBL_676148 (CHEMBL1273199)
IC50 650±n/a nM
Citation Lo, HYMan, CCFleck, RWFarrow, NAIngraham, RHKukulka, AProudfoot, JRBetageri, RKirrane, TPatel, USharma, RHoermann, MAKabcenell, ALombaert, SD Substituted pyrazoles as novel sEH antagonist: investigation of key binding interactions within the catalytic domain. Bioorg Med Chem Lett20:6379-83 (2010) 
 
Bifunctional epoxide hydrolase 2
Name:Bifunctional epoxide hydrolase 2
Type:Enzyme
Mol. Mass.:62613.07
Organism:Homo sapiens (Human)
Description:P34913
Residue:555
BDBM50330102
NameBDBM50330102
Synonyms:CHEMBL1271607 | N-(4-(3-(pyridin-3-yl)-5-(trifluoromethyl)-1H-pyrazol-1-yl)benzyl)isonicotinamide
TypeSmall organic molecule
Emp. Form.C22H16F3N5O
Mol. Mass.423.3905
SMILESFC(F)(F)c1cc(nn1-c1ccc(CNC(=O)c2ccncc2)cc1)-c1cccnc1