Reaction Details
TargetBifunctional epoxide hydrolase 2
LigandBDBM50330107
Substrate/Competitorn/a
Meas. Tech.ChEMBL_676148 (CHEMBL1273199)
IC50 21±n/a nM
Citation Lo, HYMan, CCFleck, RWFarrow, NAIngraham, RHKukulka, AProudfoot, JRBetageri, RKirrane, TPatel, USharma, RHoermann, MAKabcenell, ALombaert, SD Substituted pyrazoles as novel sEH antagonist: investigation of key binding interactions within the catalytic domain. Bioorg Med Chem Lett20:6379-83 (2010) 
 
Bifunctional epoxide hydrolase 2
Name:Bifunctional epoxide hydrolase 2
Type:Enzyme
Mol. Mass.:62613.07
Organism:Homo sapiens (Human)
Description:P34913
Residue:555
BDBM50330107
NameBDBM50330107
Synonyms:CHEMBL1271712 | N-(5-(3-(pyridin-3-yl)-5-(trifluoromethyl)-1H-pyrazol-1-yl)pyrimidin-2-yl)benzamide
TypeSmall organic molecule
Emp. Form.C20H13F3N6O
Mol. Mass.410.352
SMILESFC(F)(F)c1cc(nn1-c1cnc(NC(=O)c2ccccc2)nc1)-c1cccnc1