Reaction Details
TargetCytochrome P450 3A4
LigandBDBM50330103
Substrate/Competitorn/a
Meas. Tech.ChEMBL_676150 (CHEMBL1273201)
IC50>30±n/a nM
Citation Lo, HYMan, CCFleck, RWFarrow, NAIngraham, RHKukulka, AProudfoot, JRBetageri, RKirrane, TPatel, USharma, RHoermann, MAKabcenell, ALombaert, SD Substituted pyrazoles as novel sEH antagonist: investigation of key binding interactions within the catalytic domain. Bioorg Med Chem Lett20:6379-83 (2010) 
 
Cytochrome P450 3A4
Name:Cytochrome P450 3A4
Type:Enzyme
Mol. Mass.:57349.57
Organism:Homo sapiens (Human)
Description:n/a
Residue:503
BDBM50330103
NameBDBM50330103
Synonyms:CHEMBL1271608 | N-(5-(3-(pyridin-3-yl)-5-(trifluoromethyl)-1H-pyrazol-1-yl)pyridin-2-yl)benzamide
TypeSmall organic molecule
Emp. Form.C21H14F3N5O
Mol. Mass.409.364
SMILESFC(F)(F)c1cc(nn1-c1ccc(NC(=O)c2ccccc2)nc1)-c1cccnc1