Reaction Details
TargetBifunctional epoxide hydrolase 2
LigandBDBM50330104
Substrate/Competitorn/a
Meas. Tech.ChEMBL_676149 (CHEMBL1273200)
IC50 397±n/a nM
Citation Lo, HYMan, CCFleck, RWFarrow, NAIngraham, RHKukulka, AProudfoot, JRBetageri, RKirrane, TPatel, USharma, RHoermann, MAKabcenell, ALombaert, SD Substituted pyrazoles as novel sEH antagonist: investigation of key binding interactions within the catalytic domain. Bioorg Med Chem Lett20:6379-83 (2010) 
 
Bifunctional epoxide hydrolase 2
Name:Bifunctional epoxide hydrolase 2
Type:Enzyme
Mol. Mass.:62613.07
Organism:Homo sapiens (Human)
Description:P34913
Residue:555
BDBM50330104
NameBDBM50330104
Synonyms:CHEMBL1271658 | N-(6-(3-(pyridin-3-yl)-5-(trifluoromethyl)-1H-pyrazol-1-yl)pyridin-3-yl)benzamide
TypeSmall organic molecule
Emp. Form.C21H14F3N5O
Mol. Mass.409.364
SMILESFC(F)(F)c1cc(nn1-c1ccc(NC(=O)c2ccccc2)cn1)-c1cccnc1