Reaction Details
TargetInduced myeloid leukemia cell differentiation protein Mcl-1
LigandBDBM50330255
Substrate/Competitorn/a
Meas. Tech.ChEMBL_676278 (CHEMBL1273519)
Ki 450±n/a nM
Citation Wei, JKitada, SStebbins, JLPlaczek, WZhai, DWu, BRega, MFZhang, ZCellitti, JYang, LDahl, RReed, JCPellecchia, M Synthesis and biological evaluation of Apogossypolone derivatives as pan-active inhibitors of antiapoptotic B-cell lymphoma/leukemia-2 (Bcl-2) family proteins. J Med Chem53:8000-11 (2010) 
 
Induced myeloid leukemia cell differentiation protein Mcl-1
Name:Induced myeloid leukemia cell differentiation protein Mcl-1
Type:Membrane; Single-pass membrane protein
Mol. Mass.:37332.87
Organism:Homo sapiens (Human)
Description:Q07820
Residue:350
BDBM50330255
NameBDBM50330255
Synonyms:6,6',7,7'-Tetrahydroxy-3,3'-dimethyl-5,5'-bis(3-phenylpropyl)-2,2'-binaphthyl-1,1',4,4'-tetraone | CHEMBL1269077
TypeSmall organic molecule
Emp. Form.C40H34O8
Mol. Mass.642.6932
SMILESOc1cc2c(O)c(-c3c(O)c4cc(O)c(O)c(=CCCc5ccccc5)c4c(O)c3=C)c(=C)c(O)c2c(=CCCc2ccccc2)c1O