Reaction Details
TargetBcl-2-like protein 1
LigandBDBM50330256
Substrate/Competitorn/a
Meas. Tech.ChEMBL_676275 (CHEMBL1273516)
Ki 110±n/a nM
Citation Wei, JKitada, SStebbins, JLPlaczek, WZhai, DWu, BRega, MFZhang, ZCellitti, JYang, LDahl, RReed, JCPellecchia, M Synthesis and biological evaluation of Apogossypolone derivatives as pan-active inhibitors of antiapoptotic B-cell lymphoma/leukemia-2 (Bcl-2) family proteins. J Med Chem53:8000-11 (2010) 
 
Bcl-2-like protein 1
Name:Bcl-2-like protein 1
Type:Mitochondrion membrane; Single-pass membrane protein
Mol. Mass.:26039.60
Organism:Homo sapiens (Human)
Description:n/a
Residue:233
BDBM50330256
NameBDBM50330256
Synonyms:5,5'-Bis(4-chlorobenzyl)-6,6',7,7''-tetrahydroxy-3,3''-dimethyl-2,2'-binaphthyl-1,1',4,4'-tetraone | CHEMBL1269110
TypeSmall organic molecule
Emp. Form.C36H24Cl2O8
Mol. Mass.655.477
SMILESOc1cc2c(O)c(-c3c(O)c4cc(O)c(O)c(=Cc5ccc(Cl)cc5)c4c(O)c3=C)c(=C)c(O)c2c(=Cc2ccc(Cl)cc2)c1O