Reaction Details
TargetApoptosis regulator Bcl-2
LigandBDBM50330257
Substrate/Competitorn/a
Meas. Tech.ChEMBL_676276 (CHEMBL1273517)
Ki 150±n/a nM
Citation Wei, JKitada, SStebbins, JLPlaczek, WZhai, DWu, BRega, MFZhang, ZCellitti, JYang, LDahl, RReed, JCPellecchia, M Synthesis and biological evaluation of Apogossypolone derivatives as pan-active inhibitors of antiapoptotic B-cell lymphoma/leukemia-2 (Bcl-2) family proteins. J Med Chem53:8000-11 (2010) 
 
Apoptosis regulator Bcl-2
Name:Apoptosis regulator Bcl-2
Type:Homodimer or heterodimer
Mol. Mass.:26269.11
Organism:Homo sapiens (Human)
Description:P10415
Residue:239
BDBM50330257
NameBDBM50330257
Synonyms:6,6',7,7'-Tetrahydroxy-3,3'-dimethyl-5,5'-bis(2-phenylacetyl)-2,2'-binaphthyl-1,1',4,4'-tetraone | CHEMBL1269072
TypeSmall organic molecule
Emp. Form.C38H26O10
Mol. Mass.642.607
SMILESCC1=C(C(=O)c2cc(O)c(O)c(C(=O)Cc3ccccc3)c2C1=O)C1=C(C)C(=O)c2c(cc(O)c(O)c2C(=O)Cc2ccccc2)C1=O