Reaction Details
TargetApoptosis regulator Bcl-2
LigandBDBM50330258
Substrate/Competitorn/a
Meas. Tech.ChEMBL_676276 (CHEMBL1273517)
Ki 150±n/a nM
Citation Wei, JKitada, SStebbins, JLPlaczek, WZhai, DWu, BRega, MFZhang, ZCellitti, JYang, LDahl, RReed, JCPellecchia, M Synthesis and biological evaluation of Apogossypolone derivatives as pan-active inhibitors of antiapoptotic B-cell lymphoma/leukemia-2 (Bcl-2) family proteins. J Med Chem53:8000-11 (2010) 
 
Apoptosis regulator Bcl-2
Name:Apoptosis regulator Bcl-2
Type:Homodimer or heterodimer
Mol. Mass.:26269.11
Organism:Homo sapiens (Human)
Description:P10415
Residue:239
BDBM50330258
NameBDBM50330258
Synonyms:6,6',7,7'-Tetrahydroxy-3,3'-dimethyl-1,1',4,4'-tetraoxo-N5,N5'-bis(2-phenylpropyl)-1,1',4,4'-tetrahydro-2,2'-binaphthyl-5,5'-dicarboxamide | CHEMBL1269070
TypeSmall organic molecule
Emp. Form.C42H36N2O10
Mol. Mass.728.7426
SMILESCC(CNC(=O)c1c(O)c(O)cc2C(=O)C(=C(C)C(=O)c12)C1=C(C)C(=O)c2c(cc(O)c(O)c2C(=O)NCC(C)c2ccccc2)C1=O)c1ccccc1