Reaction Details
TargetBcl-2-related protein A1
LigandBDBM50330258
Substrate/Competitorn/a
Meas. Tech.ChEMBL_676277 (CHEMBL1273518)
Ki 470±n/a nM
Citation Wei, JKitada, SStebbins, JLPlaczek, WZhai, DWu, BRega, MFZhang, ZCellitti, JYang, LDahl, RReed, JCPellecchia, M Synthesis and biological evaluation of Apogossypolone derivatives as pan-active inhibitors of antiapoptotic B-cell lymphoma/leukemia-2 (Bcl-2) family proteins. J Med Chem53:8000-11 (2010) 
 
Bcl-2-related protein A1
Name:Bcl-2-related protein A1
Type:Apoptosis regulator protein
Mol. Mass.:20130.01
Organism:Homo sapiens (Human)
Description:n/a
Residue:175
BDBM50330258
NameBDBM50330258
Synonyms:6,6',7,7'-Tetrahydroxy-3,3'-dimethyl-1,1',4,4'-tetraoxo-N5,N5'-bis(2-phenylpropyl)-1,1',4,4'-tetrahydro-2,2'-binaphthyl-5,5'-dicarboxamide | CHEMBL1269070
TypeSmall organic molecule
Emp. Form.C42H36N2O10
Mol. Mass.728.7426
SMILESCC(CNC(=O)c1c(O)c(O)cc2C(=O)C(=C(C)C(=O)c12)C1=C(C)C(=O)c2c(cc(O)c(O)c2C(=O)NCC(C)c2ccccc2)C1=O)c1ccccc1