Reaction Details
TargetDNA gyrase subunit B
LigandBDBM50330295
Substrate/Competitorn/a
Meas. Tech.ChEMBL_677263 (CHEMBL1279101)
IC50 758±n/a nM
Citation Anderle, CStieger, MBurrell, MReinelt, SMaxwell, APage, MHeide, L Biological activities of novel gyrase inhibitors of the aminocoumarin class. Antimicrob Agents Chemother52:1982-90 (2008) 
 
DNA gyrase subunit B
Name:DNA gyrase subunit B
Type:Enzyme Subunit
Mol. Mass.:89941.28
Organism:Escherichia coli (strain K12)
Description:P0AES6
Residue:804
BDBM50330295
NameBDBM50330295
Synonyms:(2R,3R,4R,5R)-4-hydroxy-2-(4-hydroxy-3-(4-hydroxy-3-propylbenzamido)-8-methyl-2-oxo-2H-chromen-7-yloxy)-5-methoxy-6,6-dimethyltetrahydro-2H-pyran-3-yl 5-methyl-1H-pyrrole-2-carboxylate | CHEMBL1275897
TypeSmall organic molecule
Emp. Form.C34H38N2O11
Mol. Mass.650.6723
SMILESCCCc1cc(ccc1O)C(=O)Nc1c(O)c2ccc(O[C@@H]3OC(C)(C)[C@H](OC)[C@@H](O)[C@H]3OC(=O)c3ccc(C)[nH]3)c(C)c2oc1=O