Reaction Details
TargetDNA gyrase subunit B
LigandBDBM50330310
Substrate/Competitorn/a
Meas. Tech.ChEMBL_677263 (CHEMBL1279101)
IC50 116±n/a nM
Citation Anderle, CStieger, MBurrell, MReinelt, SMaxwell, APage, MHeide, L Biological activities of novel gyrase inhibitors of the aminocoumarin class. Antimicrob Agents Chemother52:1982-90 (2008) 
 
DNA gyrase subunit B
Name:DNA gyrase subunit B
Type:Enzyme Subunit
Mol. Mass.:89941.28
Organism:Escherichia coli (strain K12)
Description:P0AES6
Residue:804
BDBM50330310
NameBDBM50330310
Synonyms:(3R,4S,5R,6R)-6-(3-(3-allyl-4-hydroxybenzamido)-4-hydroxy-8-methyl-2-oxo-2H-chromen-7-yloxy)-5-hydroxy-3-methoxy-2,2-dimethyltetrahydro-2H-pyran-4-yl 5-methyl-1H-pyrrole-2-carboxylate | CHEMBL1275883
TypeSmall organic molecule
Emp. Form.C34H36N2O11
Mol. Mass.648.6564
SMILESCO[C@@H]1[C@@H](OC(=O)c2ccc(C)[nH]2)[C@@H](O)[C@H](Oc2ccc3c(O)c(NC(=O)c4ccc(O)c(CC=C)c4)c(=O)oc3c2C)OC1(C)C