Reaction Details
TargetDNA gyrase subunit B
LigandBDBM50330316
Substrate/Competitorn/a
Meas. Tech.ChEMBL_677263 (CHEMBL1279101)
IC50 73±n/a nM
Citation Anderle, CStieger, MBurrell, MReinelt, SMaxwell, APage, MHeide, L Biological activities of novel gyrase inhibitors of the aminocoumarin class. Antimicrob Agents Chemother52:1982-90 (2008) 
 
DNA gyrase subunit B
Name:DNA gyrase subunit B
Type:Enzyme Subunit
Mol. Mass.:89941.28
Organism:Escherichia coli (strain K12)
Description:P0AES6
Residue:804
BDBM50330316
NameBDBM50330316
Synonyms:(3R,4S,5R,6S)-6-(8-chloro-4-hydroxy-3-(4-hydroxy-3-isobutyramidobenzamido)-2-oxo-2H-chromen-7-yloxy)-5-hydroxy-3-methoxy-2,2-dimethyltetrahydro-2H-pyran-4-yl 5-methyl-1H-pyrrole-2-carboxylate | CHEMBL1275842
TypeSmall organic molecule
Emp. Form.C34H36ClN3O12
Mol. Mass.714.116
SMILESCO[C@@H]1[C@@H](OC(=O)c2ccc(C)[nH]2)[C@@H](O)[C@H](Oc2ccc3c(O)c(NC(=O)c4ccc(O)c(NC(=O)C(C)C)c4)c(=O)oc3c2Cl)OC1(C)C