Reaction Details
TargetDNA gyrase subunit B
LigandBDBM50330320
Substrate/Competitorn/a
Meas. Tech.ChEMBL_677263 (CHEMBL1279101)
IC50>10000±n/a nM
Citation Anderle, CStieger, MBurrell, MReinelt, SMaxwell, APage, MHeide, L Biological activities of novel gyrase inhibitors of the aminocoumarin class. Antimicrob Agents Chemother52:1982-90 (2008) 
 
DNA gyrase subunit B
Name:DNA gyrase subunit B
Type:Enzyme Subunit
Mol. Mass.:89941.28
Organism:Escherichia coli (strain K12)
Description:P0AES6
Residue:804
BDBM50330320
NameBDBM50330320
Synonyms:CHEMBL1276307 | N-(7-((2R,3R,4S,5R)-3,4-dihydroxy-5-methoxy-6,6-dimethyltetrahydro-2H-pyran-2-yloxy)-4-hydroxy-8-methyl-2-oxo-2H-chromen-3-yl)cinnamamide
TypeSmall organic molecule
Emp. Form.C27H29NO9
Mol. Mass.511.5205
SMILESCO[C@@H]1[C@@H](O)[C@@H](O)[C@H](Oc2ccc3c(O)c(NC(=O)\C=C\c4ccccc4)c(=O)oc3c2C)OC1(C)C