Reaction Details
TargetDNA gyrase subunit B
LigandBDBM50330323
Substrate/Competitorn/a
Meas. Tech.ChEMBL_677263 (CHEMBL1279101)
IC50>10000±n/a nM
Citation Anderle, CStieger, MBurrell, MReinelt, SMaxwell, APage, MHeide, L Biological activities of novel gyrase inhibitors of the aminocoumarin class. Antimicrob Agents Chemother52:1982-90 (2008) 
 
DNA gyrase subunit B
Name:DNA gyrase subunit B
Type:Enzyme Subunit
Mol. Mass.:89941.28
Organism:Escherichia coli (strain K12)
Description:P0AES6
Residue:804
BDBM50330323
NameBDBM50330323
Synonyms:CHEMBL1276304 | N-(7-((2R,3R,4S,5R)-3,4-dihydroxy-5-methoxy-6,6-dimethyltetrahydro-2H-pyran-2-yloxy)-4-hydroxy-8-methyl-2-oxo-2H-chromen-3-yl)-4-hydroxy-3-propylbenzamide
TypeSmall organic molecule
Emp. Form.C28H33NO10
Mol. Mass.543.5623
SMILESCCCc1cc(ccc1O)C(=O)Nc1c(O)c2ccc(O[C@@H]3OC(C)(C)[C@H](OC)[C@@H](O)[C@H]3O)c(C)c2oc1=O