Reaction Details
TargetDNA gyrase subunit B
LigandBDBM50423645
Substrate/Competitorn/a
Meas. Tech.ChEMBL_677263 (CHEMBL1279101)
IC50 154±n/a nM
Citation Anderle, CStieger, MBurrell, MReinelt, SMaxwell, APage, MHeide, L Biological activities of novel gyrase inhibitors of the aminocoumarin class. Antimicrob Agents Chemother52:1982-90 (2008) 
 
DNA gyrase subunit B
Name:DNA gyrase subunit B
Type:Enzyme Subunit
Mol. Mass.:89941.28
Organism:Escherichia coli (strain K12)
Description:P0AES6
Residue:804
BDBM50423645
NameBDBM50423645
Synonyms:Albamycin NOVOBIOCIN
TypeSmall organic molecule
Emp. Form.C31H36N2O11
Mol. Mass.612.6243
SMILES[#6]-[#8]-[#6@@H]1-[#6@@H](-[#8]-[#6](-[#7])=O)-[#6@H](-[#8])-[#6@@H](-[#8]-c2ccc3c(-[#8])c(-[#7]-[#6](=O)-c4ccc(-[#8])c(-[#6]\[#6]=[#6](\[#6])-[#6])c4)c(=O)oc3c2-[#6])-[#8]C1([#6])[#6]