Reaction Details
TargetRenin
LigandBDBM50330342
Substrate/Competitorn/a
Meas. Tech.ChEMBL_685577 (CHEMBL1285355)
IC50 39±n/a nM
Citation Webb, RLSchiering, NSedrani, RMaibaum, J Direct renin inhibitors as a new therapy for hypertension. J Med Chem53:7490-520 (2010) 
 
Renin
Name:Renin
Type:Enzyme
Mol. Mass.:45058.99
Organism:Homo sapiens (Human)
Description:n/a
Residue:406
BDBM50330342
NameBDBM50330342
Synonyms:CHEMBL1276497 N-((2S,3R,4S)-1-cyclohexyl-3,4-dihydroxy-6-methylheptan-2-yl)-2-methoxy-6-(3-(pyridin-3-yl)propoxy)benzamide
TypeSmall organic molecule
Emp. Form.C30H44N2O5
Mol. Mass.512.6808
SMILESCOc1cccc(OCCCc2cccnc2)c1C(=O)N[C@@H](CC1CCCCC1)[C@@H](O)[C@@H](O)CC(C)C