Reaction Details
TargetRenin
LigandBDBM50330348
Substrate/Competitorn/a
Meas. Tech.ChEMBL_685576 (CHEMBL1285354)
IC50 447±n/a nM
Citation Webb, RLSchiering, NSedrani, RMaibaum, J Direct renin inhibitors as a new therapy for hypertension. J Med Chem53:7490-520 (2010) 
 
Renin
Name:Renin
Type:Enzyme
Mol. Mass.:45058.99
Organism:Homo sapiens (Human)
Description:n/a
Residue:406
BDBM50330348
NameBDBM50330348
Synonyms:(R)-N-((S)-1-cyclohexyl-3-(methylamino)propan-2-yl)-3-((R)-(3-methoxypropoxy)(phenyl)methyl)piperidine-1-carboxamide | CHEMBL1276648
TypeSmall organic molecule
Emp. Form.C27H45N3O3
Mol. Mass.459.6645
SMILESCNC[C@H](CC1CCCCC1)NC(=O)N1CCC[C@H](C1)[C@@H](OCCCOC)c1ccccc1