Reaction Details
TargetRenin
LigandBDBM50330350
Substrate/Competitorn/a
Meas. Tech.ChEMBL_685576 (CHEMBL1285354)
IC50 2.2±n/a nM
Citation Webb, RLSchiering, NSedrani, RMaibaum, J Direct renin inhibitors as a new therapy for hypertension. J Med Chem53:7490-520 (2010) 
 
Renin
Name:Renin
Type:Enzyme
Mol. Mass.:45058.99
Organism:Homo sapiens (Human)
Description:n/a
Residue:406
BDBM50330350
NameBDBM50330350
Synonyms:(R)-3-((3S,4R,5R)-4-(4-(3-(2-methoxybenzyloxy)propoxy)phenyl)-5-((4-methoxynaphthalen-2-yl)methoxy)piperidin-3-yloxy)propane-1,2-diol Ro-65-7219
TypeSmall organic molecule
Emp. Form.C37H45NO8
Mol. Mass.631.7551
SMILESCOc1ccccc1COCCCOc1ccc(cc1)[C@H]1[C@@H](CNC[C@@H]1OCc1cc(OC)c2ccccc2c1)OC[C@H](O)CO