Reaction Details
TargetRenin
LigandBDBM50330356
Substrate/Competitorn/a
Meas. Tech.ChEMBL_685577 (CHEMBL1285355)
IC50 5000±n/a nM
Citation Webb, RLSchiering, NSedrani, RMaibaum, J Direct renin inhibitors as a new therapy for hypertension. J Med Chem53:7490-520 (2010) 
 
Renin
Name:Renin
Type:Enzyme
Mol. Mass.:45058.99
Organism:Homo sapiens (Human)
Description:n/a
Residue:406
BDBM50330356
NameBDBM50330356
Synonyms:(3R,4R)-4-(4-BROMOPHENYL)-3-(2-NAPHTHYLMETHOXY)PIPERIDINE CHEMBL1235625
TypeSmall organic molecule
Emp. Form.C22H22BrNO
Mol. Mass.396.32
SMILESBrc1ccc(cc1)[C@H]1CCNC[C@@H]1OCc1ccc2ccccc2c1