Reaction Details
TargetRenin
LigandBDBM50077683
Substrate/Competitorn/a
Meas. Tech.ChEMBL_685577 (CHEMBL1285355)
IC50 50000±n/a nM
Citation Webb, RLSchiering, NSedrani, RMaibaum, J Direct renin inhibitors as a new therapy for hypertension. J Med Chem53:7490-520 (2010) 
 
Renin
Name:Renin
Type:Enzyme
Mol. Mass.:45058.99
Organism:Homo sapiens (Human)
Description:n/a
Residue:406
BDBM50077683
NameBDBM50077683
Synonyms:4-(4-Chloro-phenyl)-3-(4-methoxy-benzyloxy)-piperidine | CHEMBL413256
TypeSmall organic molecule
Emp. Form.C19H22ClNO2
Mol. Mass.331.836
SMILESCOc1ccc(COC2CNCCC2c2ccc(Cl)cc2)cc1