Reaction Details
TargetRenin
LigandBDBM18037
Substrate/Competitorn/a
Meas. Tech.ChEMBL_685577 (CHEMBL1285355)
IC50 650±n/a nM
Citation Webb, RLSchiering, NSedrani, RMaibaum, J Direct renin inhibitors as a new therapy for hypertension. J Med Chem53:7490-520 (2010) 
 
Renin
Name:Renin
Type:Enzyme
Mol. Mass.:45058.99
Organism:Homo sapiens (Human)
Description:n/a
Residue:406
BDBM18037
NameBDBM18037
Synonyms:6-ethyl-2,4-diaminopyrimidine-based compound, 5 diaminopyrimidine renin inhibitor compound, 2
TypeSmall organic molecule
Emp. Form.C19H27N5O
Mol. Mass.341.4506
SMILESCCc1nc(N)nc(N)c1-c1ccc2CCCN(CCCOC)c2c1