Reaction Details
TargetRenin
LigandBDBM50330357
Substrate/Competitorn/a
Meas. Tech.ChEMBL_685578 (CHEMBL1285356)
IC50 20±n/a nM
Citation Webb, RLSchiering, NSedrani, RMaibaum, J Direct renin inhibitors as a new therapy for hypertension. J Med Chem53:7490-520 (2010) 
 
Renin
Name:Renin
Type:Enzyme
Mol. Mass.:45058.99
Organism:Homo sapiens (Human)
Description:n/a
Residue:406
BDBM50330357
NameBDBM50330357
Synonyms:CHEMBL1276270 | tert-butyl(6S,9S,12S)-9-((1H-imidazol-5-yl)methyl)-6-(((S)-1-(butylamino)-3-methyl-1-oxobutan-2-ylamino)methyl)-8,11-dioxo-2,3,4,5,6,7,8,9,10,11,12,13-dodecahydrobenzo[b][1,7,10]oxadiazacyclopentadecin-12-ylcarbamate
TypeSmall organic molecule
Emp. Form.C35H55N7O6
Mol. Mass.669.8545
SMILESCCCCNC(=O)[C@@H](NC[C@@H]1CCCCOc2ccccc2C[C@H](NC(=O)OC(C)(C)C)C(=O)N[C@@H](Cc2cnc[nH]2)C(=O)N1)C(C)C