Reaction Details
TargetRenin
LigandBDBM17944
Substrate/Competitorn/a
Meas. Tech.ChEMBL_685576 (CHEMBL1285354)
IC50 0.5±n/a nM
Citation Webb, RLSchiering, NSedrani, RMaibaum, J Direct renin inhibitors as a new therapy for hypertension. J Med Chem53:7490-520 (2010) 
 
Renin
Name:Renin
Type:Enzyme
Mol. Mass.:45058.99
Organism:Homo sapiens (Human)
Description:n/a
Residue:406
BDBM17944
NameBDBM17944
Synonyms:Renin nonpeptide inhibitor, 4 | methyl N-[(3R)-1-[(5S,6S,8S)-5-amino-8-(butylcarbamoyl)-6-hydroxy-3,3-dimethyl-8-(propan-2-yl)octanoyl]-1,2,3,4-tetrahydroquinolin-3-yl]carbamate
TypeSmall organic molecule
Emp. Form.C29H48N4O5
Mol. Mass.532.7152
SMILESCCCCNC(=O)[C@@H](C[C@H](O)[C@@H](N)CC(C)(C)CC(=O)N1C[C@@H](Cc2ccccc12)NC(=O)OC)C(C)C