Reaction Details
TargetRenin
LigandBDBM50330359
Substrate/Competitorn/a
Meas. Tech.ChEMBL_685576 (CHEMBL1285354)
IC50 4±n/a nM
Citation Webb, RLSchiering, NSedrani, RMaibaum, J Direct renin inhibitors as a new therapy for hypertension. J Med Chem53:7490-520 (2010) 
 
Renin
Name:Renin
Type:Enzyme
Mol. Mass.:45058.99
Organism:Homo sapiens (Human)
Description:n/a
Residue:406
BDBM50330359
NameBDBM50330359
Synonyms:CHEMBL1276429 | N-((2R,4S,5S,7R)-4-amino-8-(butylamino)-5-hydroxy-2-isopropyl-7-methyl-8-oxooctyl)-1-ethyl-1H-indole-3-carboxamide
TypeSmall organic molecule
Emp. Form.C27H44N4O3
Mol. Mass.472.6633
SMILESCCCCNC(=O)[C@H](C)C[C@H](O)[C@@H](N)C[C@@H](CNC(=O)c1cn(CC)c2ccccc12)C(C)C