Reaction Details
TargetRenin
LigandBDBM18041
Substrate/Competitorn/a
Meas. Tech.ChEMBL_685577 (CHEMBL1285355)
IC50 27±n/a nM
Citation Webb, RLSchiering, NSedrani, RMaibaum, J Direct renin inhibitors as a new therapy for hypertension. J Med Chem53:7490-520 (2010) 
 
Renin
Name:Renin
Type:Enzyme
Mol. Mass.:45058.99
Organism:Homo sapiens (Human)
Description:n/a
Residue:406
BDBM18041
NameBDBM18041
Synonyms:N-[2-({2-amino-6-ethyl-5-[4-(3-methoxypropyl)-2,2-dimethyl-3-oxo-3,4-dihydro-2H-1,4-benzoxazin-6-yl]pyrimidin-4-yl}amino)ethyl]naphthalene-2-sulfonamide | diaminopyrimidine renin inhibitor compound, 11
TypeSmall organic molecule
Emp. Form.C32H38N6O5S
Mol. Mass.618.746
SMILESCCc1nc(N)nc(NCCNS(=O)(=O)c2ccc3ccccc3c2)c1-c1ccc2OC(C)(C)C(=O)N(CCCOC)c2c1