Reaction Details
TargetRenin
LigandBDBM50330362
Substrate/Competitorn/a
Meas. Tech.ChEMBL_685576 (CHEMBL1285354)
IC50 18±n/a nM
Citation Webb, RLSchiering, NSedrani, RMaibaum, J Direct renin inhibitors as a new therapy for hypertension. J Med Chem53:7490-520 (2010) 
 
Renin
Name:Renin
Type:Enzyme
Mol. Mass.:45058.99
Organism:Homo sapiens (Human)
Description:n/a
Residue:406
BDBM50330362
NameBDBM50330362
Synonyms:(1R,5S)-N-cyclopropyl-N-((2-methoxy-3-methylpyridin-4-yl)methyl)-7-(4-(3-(2-methoxybenzyloxy)propoxy)phenyl)-3,9-diazabicyclo[3.3.1]non-6-ene-6-carboxamide | CHEMBL1276274
TypeSmall organic molecule
Emp. Form.C36H44N4O5
Mol. Mass.612.7584
SMILESCOc1ccccc1COCCCOc1ccc(cc1)C1=C([C@H]2CNC[C@@H](C1)N2)C(=O)N(Cc1ccnc(OC)c1C)C1CC1