Reaction Details
TargetStearoyl-CoA desaturase
LigandBDBM50306131
Substrate/Competitorn/a
Meas. Tech.ChEMBL_683828 (CHEMBL1285219)
IC50 0.8±n/a nM
Citation Uto, YUeno, YKiyotsuka, YMiyazawa, YKurata, HOgata, TYamada, MDeguchi, TKonishi, MTakagi, TWakimoto, SOhsumi, J Synthesis and evaluation of novel stearoyl-CoA desaturase 1 inhibitors: 1'-{6-[5-(pyridin-3-ylmethyl)-1,3,4-oxadiazol-2-yl]pyridazin-3-yl}-3,4-dihydrospiro[chromene-2,4'-piperidine] analogs. Eur J Med Chem45:4788-96 (2010) 
 
Stearoyl-CoA desaturase
Name:Stearoyl-CoA desaturase
Type:Enzyme
Mol. Mass.:41537.27
Organism:Homo sapiens (Human)
Description:O00767
Residue:359
BDBM50306131
NameBDBM50306131
Synonyms:1'-(6-(5-(pyridin-3-ylmethyl)-1,3,4-oxadiazol-2-yl)pyridazin-3-yl)-5-(trifluoromethyl)spiro[chroman-2,4'-piperidine] | CHEMBL593108
TypeSmall organic molecule
Emp. Form.C26H23F3N6O2
Mol. Mass.508.495
SMILESFC(F)(F)c1cccc2OC3(CCN(CC3)c3ccc(nn3)-c3nnc(Cc4cccnc4)o3)CCc12