Reaction Details
TargetAdenosine receptor A1
LigandBDBM50330625
Substrate/Competitorn/a
Meas. Tech.ChEMBL_685066 (CHEMBL1286682)
Ki 180±n/a nM
Citation Giovannoni, MPVergelli, CCilibrizzi, ACrocetti, LBiancalani, CGraziano, ADal Piaz, VLoza, MICadavid, MIDíaz, JLGavaldà, A Pyrazolo[1',5':1,6]pyrimido[4,5-d]pyridazin-4(3H)-ones as selective human A(1) adenosine receptor ligands. Bioorg Med Chem18:7890-9 (2010) 
 
Adenosine receptor A1
Name:Adenosine receptor A1
Type:G Protein-Coupled Receptor (GPCR)
Mol. Mass.:36520.92
Organism:Homo sapiens (Human)
Description:P30542
Residue:326
BDBM50330625
NameBDBM50330625
Synonyms:3-Benzyl-6-ethyl-9-phenyl-1-pyridin-3-yl-pyrazolo[1',5':1,6]pyrimido-[4,5-d]pyridazin-4(3H)-one | CHEMBL1278011
TypeSmall organic molecule
Emp. Form.C28H22N6O
Mol. Mass.458.5139
SMILESCCc1nc2c(c(nn(Cc3ccccc3)c2=O)-c2cccnc2)c2cc(nn12)-c1ccccc1