Reaction Details
TargetAdenosine receptor A1
LigandBDBM50330638
Substrate/Competitorn/a
Meas. Tech.ChEMBL_685066 (CHEMBL1286682)
Ki 93±n/a nM
Citation Giovannoni, MPVergelli, CCilibrizzi, ACrocetti, LBiancalani, CGraziano, ADal Piaz, VLoza, MICadavid, MIDíaz, JLGavaldà, A Pyrazolo[1',5':1,6]pyrimido[4,5-d]pyridazin-4(3H)-ones as selective human A(1) adenosine receptor ligands. Bioorg Med Chem18:7890-9 (2010) 
 
Adenosine receptor A1
Name:Adenosine receptor A1
Type:G Protein-Coupled Receptor (GPCR)
Mol. Mass.:36520.92
Organism:Homo sapiens (Human)
Description:P30542
Residue:326
BDBM50330638
NameBDBM50330638
Synonyms:3-Benzyl-1-(3-fluorophenyl)-9-phenylpyrazolo[1',5':1,6]pyrimido[4,5-d]pyridazin-4(3H)-one | CHEMBL1276939
TypeSmall organic molecule
Emp. Form.C27H18FN5O
Mol. Mass.447.4631
SMILESFc1cccc(c1)-c1nn(Cc2ccccc2)c(=O)c2ncn3nc(cc3c12)-c1ccccc1