Reaction Details
TargetAdenosine receptor A2a
LigandBDBM50330632
Substrate/Competitorn/a
Meas. Tech.ChEMBL_685067 (CHEMBL1286683)
Ki 68±n/a nM
Citation Giovannoni, MPVergelli, CCilibrizzi, ACrocetti, LBiancalani, CGraziano, ADal Piaz, VLoza, MICadavid, MIDíaz, JLGavaldà, A Pyrazolo[1',5':1,6]pyrimido[4,5-d]pyridazin-4(3H)-ones as selective human A(1) adenosine receptor ligands. Bioorg Med Chem18:7890-9 (2010) 
 
Adenosine receptor A2a
Name:Adenosine receptor A2a
Type:G Protein-Coupled Receptor (GPCR)
Mol. Mass.:44716.46
Organism:Homo sapiens (Human)
Description:P29274
Residue:412
BDBM50330632
NameBDBM50330632
Synonyms:3-Benzyl-9-phenyl-1-pyridin-4-yl-pyrazolo[1',5':1,6]pyrimido[4,5-d]pyridazin-4(3H)-one | CHEMBL1277025
TypeSmall organic molecule
Emp. Form.C26H18N6O
Mol. Mass.430.4607
SMILESO=c1n(Cc2ccccc2)nc(-c2ccncc2)c2c3cc(nn3cnc12)-c1ccccc1