Reaction Details
TargetCytochrome P450 2C19
LigandBDBM50330752
Substrate/Competitorn/a
Meas. Tech.ChEMBL_685217 (CHEMBL1287105)
IC50>10000±n/a nM
Citation Gianotti, MBotta, MBrough, SCarletti, RCastiglioni, ECorti, CDal-Cin, MDelle Fratte, SKorajac, DLovric, MMerlo, GMesic, MPavone, FPiccoli, LRast, SRoscic, MSava, ASmehil, MStasi, LTogninelli, AWigglesworth, MJ Novel spirotetracyclic zwitterionic dual H(1)/5-HT(2A) receptor antagonists for the treatment of sleep disorders. J Med Chem53:7778-95 (2010) 
 
Cytochrome P450 2C19
Name:Cytochrome P450 2C19
Type:Enzyme
Mol. Mass.:55935.47
Organism:Homo sapiens (Human)
Description:P33261
Residue:490
BDBM50330752
NameBDBM50330752
Synonyms:3-((1S)-5',11'-Dihydrospiro[cyclopentane-1,10'-dibenzo[a,d]-cyclohepten]-3-yl)-3-azabicyclo[3.1.0]hexane-1-carboxylic Acid | CHEMBL1276947
TypeSmall organic molecule
Emp. Form.C25H27NO2
Mol. Mass.373.4874
SMILESOC(=O)[C@]12C[C@H]1CN(C2)C1CC[C@@]2(C1)Cc1ccccc1Cc1ccccc21