Reaction Details
TargetHistamine H1 receptor
LigandBDBM50330747
Substrate/Competitorn/a
Meas. Tech.ChEMBL_685205 (CHEMBL1287093)
Ki 50.12±n/a nM
Citation Gianotti, MBotta, MBrough, SCarletti, RCastiglioni, ECorti, CDal-Cin, MDelle Fratte, SKorajac, DLovric, MMerlo, GMesic, MPavone, FPiccoli, LRast, SRoscic, MSava, ASmehil, MStasi, LTogninelli, AWigglesworth, MJ Novel spirotetracyclic zwitterionic dual H(1)/5-HT(2A) receptor antagonists for the treatment of sleep disorders. J Med Chem53:7778-95 (2010) 
 
Histamine H1 receptor
Name:Histamine H1 receptor
Type:G Protein-Coupled Receptor (GPCR)
Mol. Mass.:55808.72
Organism:Homo sapiens (Human)
Description:Cell pellets from SK-N-MC cells transfected with human H1 receptor were used in binding assay.
Residue:487
BDBM50330747
NameBDBM50330747
Synonyms:(-)-1-((1S)-5',11'-Dihydrospiro[cyclopentane-1,10'-dibenzo-[a,d]cyclohepten]-3-yl)-4-piperidinecarboxylic Acid | CHEMBL1277770
TypeSmall organic molecule
Emp. Form.C25H29NO2
Mol. Mass.375.5033
SMILESOC(=O)C1CCN(CC1)C1CC[C@@]2(C1)Cc1ccccc1Cc1ccccc21