Reaction Details
TargetHistamine H1 receptor
LigandBDBM50417355
Substrate/Competitorn/a
Meas. Tech.ChEMBL_685205 (CHEMBL1287093)
Ki 10±n/a nM
Citation Gianotti, MBotta, MBrough, SCarletti, RCastiglioni, ECorti, CDal-Cin, MDelle Fratte, SKorajac, DLovric, MMerlo, GMesic, MPavone, FPiccoli, LRast, SRoscic, MSava, ASmehil, MStasi, LTogninelli, AWigglesworth, MJ Novel spirotetracyclic zwitterionic dual H(1)/5-HT(2A) receptor antagonists for the treatment of sleep disorders. J Med Chem53:7778-95 (2010) 
 
Histamine H1 receptor
Name:Histamine H1 receptor
Type:G Protein-Coupled Receptor (GPCR)
Mol. Mass.:55808.72
Organism:Homo sapiens (Human)
Description:Cell pellets from SK-N-MC cells transfected with human H1 receptor were used in binding assay.
Residue:487
BDBM50417355
NameBDBM50417355
Synonyms:CHEMBL1278114
TypeSmall organic molecule
Emp. Form.C22H25NO2
Mol. Mass.335.4394
SMILESOC(=O)CCNC1CC[C@@]2(C1)Cc1ccccc1Cc1ccccc21