Reaction Details
TargetSodium channel protein type 10 subunit alpha
LigandBDBM50330934
Substrate/Competitorn/a
Meas. Tech.ChEMBL_684073 (CHEMBL1286450)
IC50 550±n/a nM
Citation Scanio, MJShi, LDrizin, IGregg, RJAtkinson, RNThomas, JBJohnson, MSChapman, MLLiu, DKrambis, MJLiu, YShieh, CCZhang, XSimler, GHJoshi, SHonore, PMarsh, KCKnox, AWerness, SAntonio, BKrafte, DSJarvis, MFFaltynek, CRMarron, BEKort, ME Discovery and biological evaluation of potent, selective, orally bioavailable, pyrazine-based blockers of the Na(v)1.8 sodium channel with efficacy in a model of neuropathic pain. Bioorg Med Chem18:7816-25 (2010) 
 
Sodium channel protein type 10 subunit alpha
Name:Sodium channel protein type 10 subunit alpha
Type:Enzyme
Mol. Mass.:219724.17
Organism:Rattus norvegicus (Rat)
Description:Q62968
Residue:1956
BDBM50330934
NameBDBM50330934
Synonyms:CHEMBL1277876 | N-((2-Pyrrolidin-1-yl-pyridin-3-yl)methyl)-6-(4-chlorophenyl)-pyrazine-2-carboxamide
TypeSmall organic molecule
Emp. Form.C21H20ClN5O
Mol. Mass.393.869
SMILESClc1ccc(cc1)-c1cncc(n1)C(=O)NCc1cccnc1N1CCCC1