Reaction Details
TargetSodium channel protein type 2 subunit alpha
LigandBDBM50330932
Substrate/Competitorn/a
Meas. Tech.ChEMBL_684076 (CHEMBL1286453)
IC50 1500±n/a nM
Citation Scanio, MJShi, LDrizin, IGregg, RJAtkinson, RNThomas, JBJohnson, MSChapman, MLLiu, DKrambis, MJLiu, YShieh, CCZhang, XSimler, GHJoshi, SHonore, PMarsh, KCKnox, AWerness, SAntonio, BKrafte, DSJarvis, MFFaltynek, CRMarron, BEKort, ME Discovery and biological evaluation of potent, selective, orally bioavailable, pyrazine-based blockers of the Na(v)1.8 sodium channel with efficacy in a model of neuropathic pain. Bioorg Med Chem18:7816-25 (2010) 
 
Sodium channel protein type 2 subunit alpha
Name:Sodium channel protein type 2 subunit alpha
Type:Enzyme
Mol. Mass.:227954.68
Organism:Homo sapiens (Human)
Description:Q99250
Residue:2005
BDBM50330932
NameBDBM50330932
Synonyms:CHEMBL1276882 | N-((2-Morpholin-4-yl-pyridin-3-yl)methyl)-6-(4-cyanophenyl)-pyrazine-2-carboxamide
TypeSmall organic molecule
Emp. Form.C22H20F3N5O3
Mol. Mass.459.4211
SMILESFC(F)(F)Oc1ccc(cc1)-c1cncc(n1)C(=O)NCc1cccnc1N1CCOCC1