Reaction Details
TargetSodium channel protein type 10 subunit alpha
LigandBDBM50330941
Substrate/Competitorn/a
Meas. Tech.ChEMBL_684075 (CHEMBL1286452)
IC50 6±n/a nM
Citation Scanio, MJShi, LDrizin, IGregg, RJAtkinson, RNThomas, JBJohnson, MSChapman, MLLiu, DKrambis, MJLiu, YShieh, CCZhang, XSimler, GHJoshi, SHonore, PMarsh, KCKnox, AWerness, SAntonio, BKrafte, DSJarvis, MFFaltynek, CRMarron, BEKort, ME Discovery and biological evaluation of potent, selective, orally bioavailable, pyrazine-based blockers of the Na(v)1.8 sodium channel with efficacy in a model of neuropathic pain. Bioorg Med Chem18:7816-25 (2010) 
 
Sodium channel protein type 10 subunit alpha
Name:Sodium channel protein type 10 subunit alpha
Type:Enzyme
Mol. Mass.:220609.21
Organism:Homo sapiens (Human)
Description:Q9Y5Y9
Residue:1956
BDBM50330941
NameBDBM50330941
Synonyms:CHEMBL1277512 | N-(3,5-Dimethoxyphenyl)-6-(4-chlorophenyl)-pyrazine-2-carboxamide acid
TypeSmall organic molecule
Emp. Form.C19H16ClN3O3
Mol. Mass.369.802
SMILESCOc1cc(NC(=O)c2cncc(n2)-c2ccc(Cl)cc2)cc(OC)c1