Reaction Details
TargetSodium channel protein type 10 subunit alpha
LigandBDBM50330949
Substrate/Competitorn/a
Meas. Tech.ChEMBL_684074 (CHEMBL1286451)
IC50 56±n/a nM
Citation Scanio, MJShi, LDrizin, IGregg, RJAtkinson, RNThomas, JBJohnson, MSChapman, MLLiu, DKrambis, MJLiu, YShieh, CCZhang, XSimler, GHJoshi, SHonore, PMarsh, KCKnox, AWerness, SAntonio, BKrafte, DSJarvis, MFFaltynek, CRMarron, BEKort, ME Discovery and biological evaluation of potent, selective, orally bioavailable, pyrazine-based blockers of the Na(v)1.8 sodium channel with efficacy in a model of neuropathic pain. Bioorg Med Chem18:7816-25 (2010) 
 
Sodium channel protein type 10 subunit alpha
Name:Sodium channel protein type 10 subunit alpha
Type:PROTEIN
Mol. Mass.:220545.77
Organism:Mus musculus
Description:ChEMBL_675096
Residue:1958
BDBM50330949
NameBDBM50330949
Synonyms:CHEMBL1277877 | N-(3,5-Dimethylphenyl)-6-(4-ethoxyphenyl)-pyrazine-2-carboxamide
TypeSmall organic molecule
Emp. Form.C21H21N3O2
Mol. Mass.347.4103
SMILESCCOc1ccc(cc1)-c1cncc(n1)C(=O)Nc1cc(C)cc(C)c1