Reaction Details
TargetHistone deacetylase 6
LigandBDBM19410
Substrate/Competitorn/a
Meas. Tech.ChEMBL_686295 (CHEMBL1293051)
IC50>10000±n/a nM
Citation Gupta, PKReid, RCLiu, LLucke, AJBroomfield, SAAndrews, MRSweet, MJFairlie, DP Inhibitors selective for HDAC6 in enzymes and cells. Bioorg Med Chem Lett20:7067-70 (2010) 
 
Histone deacetylase 6
Name:Histone deacetylase 6
Type:Chromatin regulator; hydrolase; repressor
Mol. Mass.:131381.51
Organism:Homo sapiens (Human)
Description:Q9UBN7
Residue:1215
BDBM19410
NameBDBM19410
Synonyms:CHEMBL27759 US11377423, MS-275 US9265734, MS-275 benzamide-type inhibitor, 3 | pyridin-3-ylmethyl N-({4-[(2-aminophenyl)carbamoyl]phenyl}methyl)carbamate
TypeSmall organic molecule
Emp. Form.C21H20N4O3
Mol. Mass.376.4085
SMILESNc1ccccc1NC(=O)c1ccc(CNC(=O)OCc2cccnc2)cc1