Reaction Details
TargetCytochrome P450 2C19
LigandBDBM50331234
Substrate/Competitorn/a
Meas. Tech.ChEMBL_686514 (CHEMBL1292301)
IC50>10000±n/a nM
Citation Surman, MDFreeman, EEGrabowski, JFHadden, MHenderson, AJJiang, GJiang, XMLuche, MKhmelnitsky, YVickers, SViggers, JCheetham, SGuzzo, PR 5-(pyridinon-1-yl)indazoles and 5-(furopyridinon-5-yl)indazoles as MCH-1 antagonists. Bioorg Med Chem Lett20:7015-9 (2010) 
 
Cytochrome P450 2C19
Name:Cytochrome P450 2C19
Type:Enzyme
Mol. Mass.:55935.47
Organism:Homo sapiens (Human)
Description:P33261
Residue:490
BDBM50331234
NameBDBM50331234
Synonyms:(S)-4-(benzyloxy)-1-(1-(2-(3-hydroxypyrrolidin-1-yl)ethyl)-1H-indazol-5-yl)pyridin-2(1H)-one | CHEMBL1289515
TypeSmall organic molecule
Emp. Form.C25H26N4O3
Mol. Mass.430.4989
SMILESO[C@H]1CCN(CCn2ncc3cc(ccc23)-n2ccc(OCc3ccccc3)cc2=O)C1