Reaction Details
TargetMelanin-concentrating hormone receptor 1
LigandBDBM50331245
Substrate/Competitorn/a
Meas. Tech.ChEMBL_686508 (CHEMBL1292295)
Ki 4.7±n/a nM
Citation Surman, MDFreeman, EEGrabowski, JFHadden, MHenderson, AJJiang, GJiang, XMLuche, MKhmelnitsky, YVickers, SViggers, JCheetham, SGuzzo, PR 5-(pyridinon-1-yl)indazoles and 5-(furopyridinon-5-yl)indazoles as MCH-1 antagonists. Bioorg Med Chem Lett20:7015-9 (2010) 
 
Melanin-concentrating hormone receptor 1
Name:Melanin-concentrating hormone receptor 1
Type:G Protein-Coupled Receptor (GPCR)
Mol. Mass.:45976.27
Organism:Homo sapiens (Human)
Description:Membranes from CHO-K1 cells stably expressing human MCH1R were used in assays.
Residue:422
BDBM50331245
NameBDBM50331245
Synonyms:4-(benzyloxy)-1-(1-(2-(dimethylamino)ethyl)-1H-indazol-5-yl)pyridin-2(1H)-one | CHEMBL1289282
TypeSmall organic molecule
Emp. Form.C23H24N4O2
Mol. Mass.388.4623
SMILESCN(C)CCn1ncc2cc(ccc12)-n1ccc(OCc2ccccc2)cc1=O