Reaction Details
TargetCyclin-A1/Cyclin-A2/Cyclin-dependent kinase 2
LigandBDBM50331277
Substrate/Competitorn/a
Meas. Tech.ChEMBL_686603 (CHEMBL1292398)
IC50 5380±n/a nM
Citation Herdemann, MHeit, IBosch, FUQuintini, GScheipers, CWeber, A Identification of potent ITK inhibitors through focused compound library design including structural information. Bioorg Med Chem Lett20:6998-7003 (2010) 
 
Cyclin-A1/Cyclin-A2/Cyclin-dependent kinase 2
Name:Cyclin-A1/Cyclin-A2/Cyclin-dependent kinase 2
Type:n/a
Mol. Mass.:n/a
Description:ASSAY_ID of EBI is 42813
Components:This complex has 3 components.
Component 1
Name:Cyclin-A2
Synonyms:CCN1 CCNA1 CCNA2_HUMAN Cyclin-A
Type:Enzyme Subunit
Mol. Mass.:48550.19
Organism:Homo sapiens (Human)
Description:P20248
Residue:432
Component 2
Name:Cyclin-A1
Synonyms:CCNA1 CDK2/Cyclin A1 Cyclin-A1/Cyclin-dependent kinase 4
Type:Enzyme
Mol. Mass.:52343.37
Organism:Homo sapiens (Human)
Description:P78396
Residue:465
Component 3
Name:Cyclin-dependent kinase 2
Synonyms:CDK2 CDK2_HUMAN Cell division protein kinase 2 Protein cereblon/Cyclin-dependent kinase 2 | p33 protein kinase
Type:Enzyme Subunit
Mol. Mass.:33938.17
Organism:Homo sapiens (Human)
Description:P24941
Residue:298
Component 4
Name:Cyclin-A2
Synonyms:CCN1 CCNA1 CCNA2_HUMAN Cyclin-A
Type:Enzyme Subunit
Mol. Mass.:48550.19
Organism:Homo sapiens (Human)
Description:P20248
Residue:432
BDBM50331277
NameBDBM50331277
Synonyms:3-(6-methoxy-1H-indol-2-yl)-1H-pyrazolo[4,3-b]pyridine | CHEMBL1288582
TypeSmall organic molecule
Emp. Form.C15H12N4O
Mol. Mass.264.282
SMILESCOc1ccc2cc([nH]c2c1)-c1n[nH]c2cccnc12