Reaction Details
TargetTyrosine-protein kinase ITK/TSK
LigandBDBM50331263
Substrate/Competitorn/a
Meas. Tech.ChEMBL_686535 (CHEMBL1292322)
IC50 3980±n/a nM
Citation Herdemann, MHeit, IBosch, FUQuintini, GScheipers, CWeber, A Identification of potent ITK inhibitors through focused compound library design including structural information. Bioorg Med Chem Lett20:6998-7003 (2010) 
 
Tyrosine-protein kinase ITK/TSK
Name:Tyrosine-protein kinase ITK/TSK
Type:Protein
Mol. Mass.:71839.20
Organism:Homo sapiens (Human)
Description:Q08881
Residue:620
BDBM50331263
NameBDBM50331263
Synonyms:2-(1H-indazol-3-yl)-1H-indole-6-carboxylic acid | CHEMBL1289728
TypeSmall organic molecule
Emp. Form.C16H11N3O2
Mol. Mass.277.2774
SMILESOC(=O)c1ccc2cc([nH]c2c1)-c1n[nH]c2ccccc12