Reaction Details
TargetD(1A) dopamine receptor
LigandBDBM50132069
Substrate/Competitorn/a
Meas. Tech.ChEMBL_687315 (CHEMBL1291991)
Ki 1100±n/a nM
Citation Höfling, SBMaschauer, SHübner, HGmeiner, PWester, HJPrante, OHeinrich, MR Synthesis, biological evaluation and radiolabelling by 18F-fluoroarylation of a dopamine D3-selective ligand as prospective imaging probe for PET. Bioorg Med Chem Lett20:6933-7 (2010) 
 
D(1A) dopamine receptor
Name:D(1A) dopamine receptor
Type:PROTEIN
Mol. Mass.:49269.92
Organism:Sus scrofa
Description:ChEMBL_1460140
Residue:446
BDBM50132069
NameBDBM50132069
Synonyms:3-(4-Fluoro-phenyl)-N-{4-[4-(2-methoxy-phenyl)-piperazin-1-yl]-butyl}-acrylamide | CHEMBL338606
TypeSmall organic molecule
Emp. Form.C24H30FN3O2
Mol. Mass.411.5123
SMILESCOc1ccccc1N1CCN(CCCCNC(=O)\C=C\c2ccc(F)cc2)CC1