Reaction Details
TargetD(2) dopamine receptor
LigandBDBM50132047
Substrate/Competitorn/a
Meas. Tech.ChEMBL_687314 (CHEMBL1291990)
Ki 22.6±n/a nM
Citation Höfling, SBMaschauer, SHübner, HGmeiner, PWester, HJPrante, OHeinrich, MR Synthesis, biological evaluation and radiolabelling by 18F-fluoroarylation of a dopamine D3-selective ligand as prospective imaging probe for PET. Bioorg Med Chem Lett20:6933-7 (2010) 
 
D(2) dopamine receptor
Name:D(2) dopamine receptor
Type:Cell-surface receptors
Mol. Mass.:50647.10
Organism:Homo sapiens (Human)
Description:P14416
Residue:443
BDBM50132047
NameBDBM50132047
Synonyms:3-(4-Chloro-phenyl)-N-{4-[4-(2-methoxy-phenyl)-piperazin-1-yl]-butyl}-acrylamide; oxalic acid CHEMBL126725
TypeSmall organic molecule
Emp. Form.C24H30ClN3O2
Mol. Mass.427.967
SMILESCOc1ccccc1N1CCN(CCCCNC(=O)\C=C\c2ccc(Cl)cc2)CC1