Reaction Details
Target5-hydroxytryptamine receptor 2A
LigandBDBM50132069
Substrate/Competitorn/a
Meas. Tech.ChEMBL_687309 (CHEMBL1291985)
Ki 330±n/a nM
Citation Höfling, SBMaschauer, SHübner, HGmeiner, PWester, HJPrante, OHeinrich, MR Synthesis, biological evaluation and radiolabelling by 18F-fluoroarylation of a dopamine D3-selective ligand as prospective imaging probe for PET. Bioorg Med Chem Lett20:6933-7 (2010) 
 
5-hydroxytryptamine receptor 2A
Name:5-hydroxytryptamine receptor 2A
Type:Enzyme Catalytic Domain
Mol. Mass.:52679.13
Organism:PIG
Description:5-HT2 0 0::P50129
Residue:470
BDBM50132069
NameBDBM50132069
Synonyms:3-(4-Fluoro-phenyl)-N-{4-[4-(2-methoxy-phenyl)-piperazin-1-yl]-butyl}-acrylamide | CHEMBL338606
TypeSmall organic molecule
Emp. Form.C24H30FN3O2
Mol. Mass.411.5123
SMILESCOc1ccccc1N1CCN(CCCCNC(=O)\C=C\c2ccc(F)cc2)CC1