Reaction Details
TargetSerine/threonine-protein kinase Nek3
LigandBDBM50331612
Substrate/Competitorn/a
Meas. Tech.ChEMBL_687477 (CHEMBL1292153)
Ki>1000000±n/a nM
Citation Krug, MErlenkamp, GSippl, WSchächtele, CTotzke, FHilgeroth, A Discovery and selectivity-profiling of 4-benzylamino 1-aza-9-oxafluorene derivatives as lead structures for IGF-1R inhibitors. Bioorg Med Chem Lett20:6915-9 (2010) 
 
Serine/threonine-protein kinase Nek3
Name:Serine/threonine-protein kinase Nek3
Type:PROTEIN
Mol. Mass.:57709.05
Organism:Homo sapiens (Human)
Description:ChEMBL_774350
Residue:506
BDBM50331612
NameBDBM50331612
Synonyms:CHEMBL1290072 | N-(4-methoxybenzyl)benzofuro[2,3-b]pyridin-4-amine
TypeSmall organic molecule
Emp. Form.C19H16N2O2
Mol. Mass.304.3425
SMILESCOc1ccc(CNc2ccnc3oc4ccccc4c23)cc1