Reaction Details
TargetVascular endothelial growth factor receptor 2
LigandBDBM50331615
Substrate/Competitorn/a
Meas. Tech.ChEMBL_687451 (CHEMBL1292127)
Ki>1000000±n/a nM
Citation Krug, MErlenkamp, GSippl, WSchächtele, CTotzke, FHilgeroth, A Discovery and selectivity-profiling of 4-benzylamino 1-aza-9-oxafluorene derivatives as lead structures for IGF-1R inhibitors. Bioorg Med Chem Lett20:6915-9 (2010) 
 
Vascular endothelial growth factor receptor 2
Name:Vascular endothelial growth factor receptor 2
Type:Receptor Tyrosine Kinase
Mol. Mass.:151510.97
Organism:Homo sapiens (Human)
Description:P35968
Residue:1356
BDBM50331615
NameBDBM50331615
Synonyms:CHEMBL1290073 | N-(3-chlorobenzyl)benzofuro[2,3-b]pyridin-4-amine
TypeSmall organic molecule
Emp. Form.C18H13ClN2O
Mol. Mass.308.762
SMILESClc1cccc(CNc2ccnc3oc4ccccc4c23)c1